TAP version 13 not ok 1 - request-promise v4.2.2 The canary is dead: ---
# > publish-please@2.1.4 postinstall /tmp/5e223a50-480d-4774-9aea-c08352467734/request-promise/node_modules/publish-please
# > node lib/init.js
# > request-promise@4.2.2 prepublish /tmp/5e223a50-480d-4774-9aea-c08352467734/request-promise
# > publish-please guard
# added 726 packages in 136.033s
# > request-promise@4.2.2 test /tmp/5e223a50-480d-4774-9aea-c08352467734/request-promise
# > gulp ci
# [12:01:38] Using gulpfile /tmp/5e223a50-480d-4774-9aea-c08352467734/request-promise/gulpfile.js
# [12:01:38] Starting 'ci'...
# [12:01:38] Starting 'validate'...
# [12:01:38] Starting 'lint'...
# [12:01:39] Finished 'lint' after 721 ms
# [12:01:39] Starting 'clean-coverage'...
# [12:01:39] Finished 'clean-coverage' after 3.96 ms
# [12:01:39] Starting 'clean'...
# [12:01:39] Finished 'clean' after 11 s
# [12:01:39] Starting 'test'...
# Request-Promise
# should inform about the dropped CLS support
# should not resolve the promise if .abort() is used (108ms)
# 1) should allow the use of tough-cookie - issue
#183
# should expose
# .then(...) (51ms)
# .catch(...) and the error types
# .finally(...)
# .promise() returning a Bluebird promise
# .cancel() cancelling the Bluebird promise and aborting the request
# .cancel() on promises chained from the Bluebird promise, aborting the request
# should still allow to require Request independently
# by not interfering with Request required afterwards (663ms)
# by not interfering with Request required beforehand (754ms)
# by not interfering with Request required beforehand and afterwards being identical (591ms)
# 11 passing (2s)
# 1 failing
# 1) Request-Promise should allow the use of tough-cookie - issue
#183:
# AssertionError: expected [Function] to not throw an error but 'TypeError: str.trim is not a function' was thrown
# at Context. (test/spec/request-test.js:212:24)
# [12:01:41] 'test' errored after 2.54 s
# [12:01:41] Error: TESTS FAILED
# at Stream. (/tmp/5e223a50-480d-4774-9aea-c08352467734/request-promise/gulpfile.js:82:26)
# at emitOne (events.js:121:20)
# at Stream.emit (events.js:211:7)
# at /tmp/5e223a50-480d-4774-9aea-c08352467734/request-promise/node_modules/gulp-mocha/index.js:60:12
# at done (/tmp/5e223a50-480d-4774-9aea-c08352467734/request-promise/node_modules/mocha/lib/mocha.js:498:13)
# at Runner. (/tmp/5e223a50-480d-4774-9aea-c08352467734/request-promise/node_modules/mocha/lib/runner.js:799:5)
# at emitNone (events.js:111:20)
# at Runner.emit (events.js:208:7)
# at /tmp/5e223a50-480d-4774-9aea-c08352467734/request-promise/node_modules/mocha/lib/runner.js:786:12
# at /tmp/5e223a50-480d-4774-9aea-c08352467734/request-promise/node_modules/mocha/lib/runner.js:639:9
# at next (/tmp/5e223a50-480d-4774-9aea-c08352467734/request-promise/node_modules/mocha/lib/runner.js:284:14)
# at Immediate. (/tmp/5e223a50-480d-4774-9aea-c08352467734/request-promise/node_modules/mocha/lib/runner.js:320:5)
# at runCallback (timers.js:810:20)
# at tryOnImmediate (timers.js:768:5)
# at processImmediate [as _immediateCallback] (timers.js:745:5)
# [12:01:41] 'ci' errored after 3.28 s
# [12:01:41] Error in plugin 'run-sequence(test)'
# Message:
# TESTS FAILED
# Stack:
# Error: TESTS FAILED
# at Stream. (/tmp/5e223a50-480d-4774-9aea-c08352467734/request-promise/gulpfile.js:82:26)
# at emitOne (events.js:121:20)
# at Stream.emit (events.js:211:7)
# at /tmp/5e223a50-480d-4774-9aea-c08352467734/request-promise/node_modules/gulp-mocha/index.js:60:12
# at done (/tmp/5e223a50-480d-4774-9aea-c08352467734/request-promise/node_modules/mocha/lib/mocha.js:498:13)
# at Runner. (/tmp/5e223a50-480d-4774-9aea-c08352467734/request-promise/node_modules/mocha/lib/runner.js:799:5)
# at emitNone (events.js:111:20)
# at Runner.emit (events.js:208:7)
# at /tmp/5e223a50-480d-4774-9aea-c08352467734/request-promise/node_modules/mocha/lib/runner.js:786:12
# at /tmp/5e223a50-480d-4774-9aea-c08352467734/request-promise/node_modules/mocha/lib/runner.js:639:9
# at next (/tmp/5e223a50-480d-4774-9aea-c08352467734/request-promise/node_modules/mocha/lib/runner.js:284:14)
# at Immediate. (/tmp/5e223a50-480d-4774-9aea-c08352467734/request-promise/node_modules/mocha/lib/runner.js:320:5)
# at runCallback (timers.js:810:20)
# at tryOnImmediate (timers.js:768:5)
# at processImmediate [as _immediateCallback] (timers.js:745:5)
# [12:01:41] 'validate' errored after 3.28 s
# [12:01:41] Error in plugin 'run-sequence(ci)'
# Message:
# TESTS FAILED
# Stack:
# Error: TESTS FAILED
# at Stream. (/tmp/5e223a50-480d-4774-9aea-c08352467734/request-promise/gulpfile.js:82:26)
# at emitOne (events.js:121:20)
# at Stream.emit (events.js:211:7)
# at /tmp/5e223a50-480d-4774-9aea-c08352467734/request-promise/node_modules/gulp-mocha/index.js:60:12
# at done (/tmp/5e223a50-480d-4774-9aea-c08352467734/request-promise/node_modules/mocha/lib/mocha.js:498:13)
# at Runner. (/tmp/5e223a50-480d-4774-9aea-c08352467734/request-promise/node_modules/mocha/lib/runner.js:799:5)
# at emitNone (events.js:111:20)
# at Runner.emit (events.js:208:7)
# at /tmp/5e223a50-480d-4774-9aea-c08352467734/request-promise/node_modules/mocha/lib/runner.js:786:12
# at /tmp/5e223a50-480d-4774-9aea-c08352467734/request-promise/node_modules/mocha/lib/runner.js:639:9
# at next (/tmp/5e223a50-480d-4774-9aea-c08352467734/request-promise/node_modules/mocha/lib/runner.js:284:14)
# at Immediate. (/tmp/5e223a50-480d-4774-9aea-c08352467734/request-promise/node_modules/mocha/lib/runner.js:320:5)
# at runCallback (timers.js:810:20)
# at tryOnImmediate (timers.js:768:5)
# at processImmediate [as _immediateCallback] (timers.js:745:5)
# [12:01:41] 'validate' errored after 3.28 s
# [12:01:41] Error in plugin 'run-sequence(test)'
# Message:
# TESTS FAILED
# Stack:
# Error: TESTS FAILED
# at Stream. (/tmp/5e223a50-480d-4774-9aea-c08352467734/request-promise/gulpfile.js:82:26)
# at emitOne (events.js:121:20)
# at Stream.emit (events.js:211:7)
# at /tmp/5e223a50-480d-4774-9aea-c08352467734/request-promise/node_modules/gulp-mocha/index.js:60:12
# at done (/tmp/5e223a50-480d-4774-9aea-c08352467734/request-promise/node_modules/mocha/lib/mocha.js:498:13)
# at Runner. (/tmp/5e223a50-480d-4774-9aea-c08352467734/request-promise/node_modules/mocha/lib/runner.js:799:5)
# at emitNone (events.js:111:20)
# at Runner.emit (events.js:208:7)
# at /tmp/5e223a50-480d-4774-9aea-c08352467734/request-promise/node_modules/mocha/lib/runner.js:786:12
# at /tmp/5e223a50-480d-4774-9aea-c08352467734/request-promise/node_modules/mocha/lib/runner.js:639:9
# at next (/tmp/5e223a50-480d-4774-9aea-c08352467734/request-promise/node_modules/mocha/lib/runner.js:284:14)
# at Immediate. (/tmp/5e223a50-480d-4774-9aea-c08352467734/request-promise/node_modules/mocha/lib/runner.js:320:5)
# at runCallback (timers.js:810:20)
# at tryOnImmediate (timers.js:768:5)
# at processImmediate [as _immediateCallback] (timers.js:745:5)
# Error in plugin 'gulp-mocha'
# Message:
# 1 test failed.
# TESTS FAILED
# npm ERR! Test failed. See above for more details. duration_ms: 154191 ... 1..1