TAP version 13 not ok 1 - request-promise v4.2.2 The canary is dead: ---
# > publish-please@2.1.4 postinstall /tmp/241a502f-232b-40a8-a5ec-ecba0e4b8344/request-promise/node_modules/publish-please
# > node lib/init.js
# > request-promise@4.2.2 prepublish /tmp/241a502f-232b-40a8-a5ec-ecba0e4b8344/request-promise
# > publish-please guard
# added 726 packages in 127.204s
# > request-promise@4.2.2 test /tmp/241a502f-232b-40a8-a5ec-ecba0e4b8344/request-promise
# > gulp ci
# [09:56:46] Using gulpfile /tmp/241a502f-232b-40a8-a5ec-ecba0e4b8344/request-promise/gulpfile.js
# [09:56:46] Starting 'ci'...
# [09:56:46] Starting 'validate'...
# [09:56:46] Starting 'lint'...
# [09:56:47] Finished 'lint' after 1.12 s
# [09:56:47] Starting 'clean-coverage'...
# [09:56:47] Finished 'clean-coverage' after 5.66 ms
# [09:56:47] Starting 'clean'...
# [09:56:47] Finished 'clean' after 27 s
# [09:56:47] Starting 'test'...
# Request-Promise
# should inform about the dropped CLS support
# should not resolve the promise if .abort() is used (115ms)
# 1) should allow the use of tough-cookie - issue
#183
# should expose
# .then(...) (133ms)
# .catch(...) and the error types
# .finally(...)
# .promise() returning a Bluebird promise
# .cancel() cancelling the Bluebird promise and aborting the request
# .cancel() on promises chained from the Bluebird promise, aborting the request
# should still allow to require Request independently
# by not interfering with Request required afterwards (918ms)
# by not interfering with Request required beforehand (768ms)
# by not interfering with Request required beforehand and afterwards being identical (783ms)
# 11 passing (3s)
# 1 failing
# 1) Request-Promise should allow the use of tough-cookie - issue
#183:
# AssertionError: expected [Function] to not throw an error but 'TypeError: str.trim is not a function' was thrown
# at Context. (test/spec/request-test.js:212:24)
# [09:56:51] 'test' errored after 3.3 s
# [09:56:51] Error: TESTS FAILED
# at Stream. (/tmp/241a502f-232b-40a8-a5ec-ecba0e4b8344/request-promise/gulpfile.js:82:26)
# at emitOne (events.js:121:20)
# at Stream.emit (events.js:211:7)
# at /tmp/241a502f-232b-40a8-a5ec-ecba0e4b8344/request-promise/node_modules/gulp-mocha/index.js:60:12
# at done (/tmp/241a502f-232b-40a8-a5ec-ecba0e4b8344/request-promise/node_modules/mocha/lib/mocha.js:498:13)
# at Runner. (/tmp/241a502f-232b-40a8-a5ec-ecba0e4b8344/request-promise/node_modules/mocha/lib/runner.js:799:5)
# at emitNone (events.js:111:20)
# at Runner.emit (events.js:208:7)
# at /tmp/241a502f-232b-40a8-a5ec-ecba0e4b8344/request-promise/node_modules/mocha/lib/runner.js:786:12
# at /tmp/241a502f-232b-40a8-a5ec-ecba0e4b8344/request-promise/node_modules/mocha/lib/runner.js:639:9
# at next (/tmp/241a502f-232b-40a8-a5ec-ecba0e4b8344/request-promise/node_modules/mocha/lib/runner.js:284:14)
# at Immediate. (/tmp/241a502f-232b-40a8-a5ec-ecba0e4b8344/request-promise/node_modules/mocha/lib/runner.js:320:5)
# at runCallback (timers.js:810:20)
# at tryOnImmediate (timers.js:768:5)
# at processImmediate [as _immediateCallback] (timers.js:745:5)
# [09:56:51] 'ci' errored after 4.44 s
# [09:56:51] Error in plugin 'run-sequence(test)'
# Message:
# TESTS FAILED
# Stack:
# Error: TESTS FAILED
# at Stream. (/tmp/241a502f-232b-40a8-a5ec-ecba0e4b8344/request-promise/gulpfile.js:82:26)
# at emitOne (events.js:121:20)
# at Stream.emit (events.js:211:7)
# at /tmp/241a502f-232b-40a8-a5ec-ecba0e4b8344/request-promise/node_modules/gulp-mocha/index.js:60:12
# at done (/tmp/241a502f-232b-40a8-a5ec-ecba0e4b8344/request-promise/node_modules/mocha/lib/mocha.js:498:13)
# at Runner. (/tmp/241a502f-232b-40a8-a5ec-ecba0e4b8344/request-promise/node_modules/mocha/lib/runner.js:799:5)
# at emitNone (events.js:111:20)
# at Runner.emit (events.js:208:7)
# at /tmp/241a502f-232b-40a8-a5ec-ecba0e4b8344/request-promise/node_modules/mocha/lib/runner.js:786:12
# at /tmp/241a502f-232b-40a8-a5ec-ecba0e4b8344/request-promise/node_modules/mocha/lib/runner.js:639:9
# at next (/tmp/241a502f-232b-40a8-a5ec-ecba0e4b8344/request-promise/node_modules/mocha/lib/runner.js:284:14)
# at Immediate. (/tmp/241a502f-232b-40a8-a5ec-ecba0e4b8344/request-promise/node_modules/mocha/lib/runner.js:320:5)
# at runCallback (timers.js:810:20)
# at tryOnImmediate (timers.js:768:5)
# at processImmediate [as _immediateCallback] (timers.js:745:5)
# [09:56:51] 'validate' errored after 4.44 s
# [09:56:51] Error in plugin 'run-sequence(ci)'
# Message:
# TESTS FAILED
# Stack:
# Error: TESTS FAILED
# at Stream. (/tmp/241a502f-232b-40a8-a5ec-ecba0e4b8344/request-promise/gulpfile.js:82:26)
# at emitOne (events.js:121:20)
# at Stream.emit (events.js:211:7)
# at /tmp/241a502f-232b-40a8-a5ec-ecba0e4b8344/request-promise/node_modules/gulp-mocha/index.js:60:12
# at done (/tmp/241a502f-232b-40a8-a5ec-ecba0e4b8344/request-promise/node_modules/mocha/lib/mocha.js:498:13)
# at Runner. (/tmp/241a502f-232b-40a8-a5ec-ecba0e4b8344/request-promise/node_modules/mocha/lib/runner.js:799:5)
# at emitNone (events.js:111:20)
# at Runner.emit (events.js:208:7)
# at /tmp/241a502f-232b-40a8-a5ec-ecba0e4b8344/request-promise/node_modules/mocha/lib/runner.js:786:12
# at /tmp/241a502f-232b-40a8-a5ec-ecba0e4b8344/request-promise/node_modules/mocha/lib/runner.js:639:9
# at next (/tmp/241a502f-232b-40a8-a5ec-ecba0e4b8344/request-promise/node_modules/mocha/lib/runner.js:284:14)
# at Immediate. (/tmp/241a502f-232b-40a8-a5ec-ecba0e4b8344/request-promise/node_modules/mocha/lib/runner.js:320:5)
# at runCallback (timers.js:810:20)
# at tryOnImmediate (timers.js:768:5)
# at processImmediate [as _immediateCallback] (timers.js:745:5)
# [09:56:51] 'validate' errored after 4.44 s
# [09:56:51] Error in plugin 'run-sequence(test)'
# Message:
# TESTS FAILED
# Stack:
# Error: TESTS FAILED
# at Stream. (/tmp/241a502f-232b-40a8-a5ec-ecba0e4b8344/request-promise/gulpfile.js:82:26)
# at emitOne (events.js:121:20)
# at Stream.emit (events.js:211:7)
# at /tmp/241a502f-232b-40a8-a5ec-ecba0e4b8344/request-promise/node_modules/gulp-mocha/index.js:60:12
# at done (/tmp/241a502f-232b-40a8-a5ec-ecba0e4b8344/request-promise/node_modules/mocha/lib/mocha.js:498:13)
# at Runner. (/tmp/241a502f-232b-40a8-a5ec-ecba0e4b8344/request-promise/node_modules/mocha/lib/runner.js:799:5)
# at emitNone (events.js:111:20)
# at Runner.emit (events.js:208:7)
# at /tmp/241a502f-232b-40a8-a5ec-ecba0e4b8344/request-promise/node_modules/mocha/lib/runner.js:786:12
# at /tmp/241a502f-232b-40a8-a5ec-ecba0e4b8344/request-promise/node_modules/mocha/lib/runner.js:639:9
# at next (/tmp/241a502f-232b-40a8-a5ec-ecba0e4b8344/request-promise/node_modules/mocha/lib/runner.js:284:14)
# at Immediate. (/tmp/241a502f-232b-40a8-a5ec-ecba0e4b8344/request-promise/node_modules/mocha/lib/runner.js:320:5)
# at runCallback (timers.js:810:20)
# at tryOnImmediate (timers.js:768:5)
# at processImmediate [as _immediateCallback] (timers.js:745:5)
# Error in plugin 'gulp-mocha'
# Message:
# 1 test failed.
# TESTS FAILED
# npm ERR! Test failed. See above for more details. duration_ms: 145963 ... 1..1